publication_title,print_identifier,online_identifier,date_first_issue_online,num_first_vol_online,num_first_issue_online,date_last_issue_online,num_last_vol_online,num_last_issue_online,title_url,first_author,title_id,embargo_info,coverage_depth,notes,publisher_name,publication_type,date_monograph_published_print,date_monograph_published_online,monograph_volume,mongraph_edition,first_editor,parent_publication_title_id,Preceding_publication_title_id,access_type,frequency
"20 Years of Law Reform",642233527,,,,,,,,https://heinonline.org/HOL/Index?index=alrc/twyear&collection=alrc,,twyear,,fulltext,,"Sydney, NSW: The Commission,",monograph,1995,,,,,,,P,
"Aboriginal Child Placement Principle",0731010128,,,,,,,,https://heinonline.org/HOL/Page?handle=hein.alrc/abchpla0001&collection=alrc,Lock,abchpla,,fulltext,,"Sydney: The Commission,",monograph,1997,,,,,,,P,
"Aboriginal Customary Law - Marriage, Children and the Distribution of Property",0642881006,,,,,,,,https://heinonline.org/HOL/Page?handle=hein.alrc/abclma0001&collection=alrc,,abclma,,fulltext,,"Sydney: Australian Law Reform Commission,",monograph,1982,,,,,,,P,
"Aboriginal Customary Law - Recognition",0642894795,,,,,,,,https://heinonline.org/HOL/Page?handle=hein.alrc/abculrg0001&collection=alrc,,abculrg,,fulltext,,"Sydney: Australian Law Reform Commission,",monograph,1980,,,,,,,P,
"Aboriginal Customary Law - The Criminal Law, Evidence and Procedure",0642100950,,,,,,,,https://heinonline.org/HOL/Page?handle=hein.alrc/abcrep0001&collection=alrc,,abcrep,,fulltext,,"Sydney: Australian Law Reform Commission,",monograph,1984,,,,,,,P,
"Aboriginal Customary Law and Local Justice Mechanisms: Principles, Options and Proposals",,,,,,,,,https://heinonline.org/HOL/Page?handle=hein.alrc/abcusto0001&collection=alrc,Hennessy,abcusto,,fulltext,,"Sydney, N.S.W.: Australian Law Reform Commission,",monograph,1984,,,,,,,P,
"Aboriginal Customary Law and the Substantive Criminal Law",,,,,,,,,https://heinonline.org/HOL/Page?handle=hein.alrc/abculaw0001&collection=alrc,Crawford,abculaw,,fulltext,,"Sydney, N.S.W.: Australian Law Reform Commission,",monograph,1982,,,,,,,P,
"Aboriginal Customary Law and the Substantive Criminal Law: Research Paper 6A: Appendix: Cases on Traditional Punishment and Sentencing",,,,,,,,,https://heinonline.org/HOL/Page?handle=hein.alrc/acustlaw0001&collection=alrc,Crawford,acustlaw,,fulltext,,"Sydney: The Commission,",monograph,1982,,,,,,,P,
"Aboriginal Customary Law: Problems of Evidence and Procedure",,,,,,,,,https://heinonline.org/HOL/Page?handle=hein.alrc/abcuslaw0001&collection=alrc,Hennessy,abcuslaw,,fulltext,,"Sydney, N.S.W.: Australian Law Reform Commission,",monograph,1983,,,,,,,P,
"Aboriginal Customary Law: Research Paper No. 4: Aboriginal Customary Law: Child Custody, Fostering and Adoption",,,,,,,,,https://heinonline.org/HOL/Page?handle=hein.alrc/abcustlw0001&collection=alrc,Crawford,abcustlw,,fulltext,,"Sydney: Australian Law Reform Commission,",monograph,1982,,,,,,,P,
"Aboriginal Customary Law: Research Paper No. 8: Aboriginal Customary Law: A General Regime for Recognition",,,,,,,,,https://heinonline.org/HOL/Page?handle=hein.alrc/abculage0001&collection=alrc,Crawford,abculage,,fulltext,,"Sydney, N.S.W.: Australian Law Reform Commission,",monograph,1982,,,,,,,P,
"Aboriginal Customary Law: The Recognition of Traditional Hunting, Fishing and Gathering Rights",,,,,,,,,https://heinonline.org/HOL/Page?handle=hein.alrc/abcuslw0001&collection=alrc,Fisher,abcuslw,,fulltext,,"Sydney, N.S.W.: Australian Law Reform Commission,",monograph,1984,,,,,,,P,
"Aboriginal Customary Law: Traditional and Modern Distributions of Property",,,,,,,,,https://heinonline.org/HOL/Page?handle=hein.alrc/abcustlaw0001&collection=alrc,Hennessy,abcustlaw,,fulltext,,"Sydney, N.S.W.: Australian Law Reform Commission,",monograph,1982,,,,,,,P,
"Access All Ages - Older Workers and Commonwealth Laws",9780987387202,,,,,,,,https://heinonline.org/HOL/Index?index=alrc/acalage&collection=alrc,,acalage,,fulltext,,"Sydney: Australian Law Reform Commission,",monograph,2013,,,,,,,P,
"Access to Courts - 1: Standing: Public Interest Suits",0642908176,,,,,,,,https://heinonline.org/HOL/Page?handle=hein.alrc/acccour0001&collection=alrc,,acccour,,fulltext,,"Sydney [A.C.T.]: Law Reform Commission,",monograph,1977,,,,,,,P,
"Access to the Courts - I: Standing: Public Interest Suits",,,,,,,,,https://heinonline.org/HOL/Page?handle=hein.alrc/actspis0001&collection=alrc,,actspis,,fulltext,,"Sydney: Australian Law Reform Commission,",monograph,1977,,,,,,,P,
"Access to the Courts - II: Class Actions",0642907005,,,,,,,,https://heinonline.org/HOL/Page?handle=hein.alrc/actcs0001&collection=alrc,,actcs,,fulltext,,"Sydney: Australian Law Reform Commission,",monograph,1979,,,,,,,P,
"Access to the Law: Accountability of the Legal Profession",0730623122,,,,,,,,https://heinonline.org/HOL/Page?handle=hein.alrc/acclwa0001&collection=alrc,,acclwa,,fulltext,,"Melbourne: Law Reform Commission of Victoria,",monograph,1991,,,,,,,P,
"Access to the Law: Accountability of the Legal Profession",073062319X,,,,,,,,https://heinonline.org/HOL/Page?handle=hein.alrc/aclawacc0001&collection=alrc,,aclawacc,,fulltext,,"[Melbourne]: Law Reform Commission of Victoria,",monograph,1992,,,,,,,P,
"Access to the Law: Restrictions on Legal Practice",0730623173,,,,,,,,https://heinonline.org/HOL/Page?handle=hein.alrc/acclwres0001&collection=alrc,,acclwres,,fulltext,,"[Melbourne]: The Commission,",monograph,1991,,,,,,,P,
"Access to the Law: Restrictions on Legal Practice",,,,,,,,,https://heinonline.org/HOL/Page?handle=hein.alrc/acclawre0001&collection=alrc,,acclawre,,fulltext,,"[Melbourne]: Law Reform Commission of Victoria,",monograph,1992,,,,,,,P,
"Access to the Law: The Structure and Format of Legislation",0730605639,,,,,,,,https://heinonline.org/HOL/Page?handle=hein.alrc/aclwstr0001&collection=alrc,,aclwstr,,fulltext,,"Melbourne, Vic: The Commission,",monograph,1990,,,,,,,P,
"Accident Compensation",724074767,,,,,,,,https://heinonline.org/HOL/Index?index=alrc/accompen&collection=alrc,,accompen,,fulltext,,"[Sydney]: The Commission,",monograph,1982,,,,,,,P,
"Accident Compensation, Final Report 1: A Transport Accidents Scheme for New South Wales",,,,,,,,,https://heinonline.org/HOL/Index?index=alrc/accfnlrpt&collection=alrc,,accfnlrpt,,fulltext,,"Sydney, N.S.W.: New South Wales Law Reform Commission,",monograph,1984,,,,,,,P,
"Administrative Penalties: Customs Act 1901 (Cth) Part XIII, Division 4",,,,,,,,,https://heinonline.org/HOL/Page?handle=hein.alrc/admpn0001&collection=alrc,,admpn,,fulltext,,"Sydney: Australian Law Reform Commission,",monograph,1992,,,,,,,P,
"Administrative Penalties in Customs and Excise",0642182930,,,,,,,,https://heinonline.org/HOL/Page?handle=hein.alrc/admpenc0001&collection=alrc,,admpenc,,fulltext,,"Sydney: The Commission,",monograph,1992,,,,,,,P,
"Admiralty Jurisdiction",,,,,,,,,https://heinonline.org/HOL/Page?handle=hein.alrc/admju0001&collection=alrc,,admju,,fulltext,,"Sydney: Australian Law Reform Commission,",monograph,1984,,,,,,,P,
"Admiralty Jurisdiction in Australia: The Courts Exercising Original and Appellate Jurisdiction",,,,,,,,,https://heinonline.org/HOL/Page?handle=hein.alrc/adjuris0001&collection=alrc,Curran,adjuris,,fulltext,,"Sydney: Australian Law Reform Commission,",monograph,1984,,,,,,,P,
Admissions,,,,,,,,,https://heinonline.org/HOL/Page?handle=hein.alrc/admissi0001&collection=alrc,Odgers,admissi,,fulltext,,"Sydney: Australian Law Reform Commission,",monograph,1983,,,,,,,P,
"Adversarial: Civil Litigation Practice and Procedure",,,,,,,,,https://heinonline.org/HOL/Page?handle=hein.alrc/adcivlit0001&collection=alrc,,adcivlit,,fulltext,,"Sydney: The Commission,",monograph,1996,,,,,,,P,
"Adversarial: Federal Jurisdiction",,,,,,,,,https://heinonline.org/HOL/Page?handle=hein.alrc/adfedjur0001&collection=alrc,,adfedjur,,fulltext,,"Sydney: The Commission,",monograph,1996,,,,,,,P,
"Adversarial: Judicial and Case Management",,,,,,,,,https://heinonline.org/HOL/Page?handle=hein.alrc/adjudca0001&collection=alrc,,adjudca,,fulltext,,"Sydney: The Commission,",monograph,1996,,,,,,,P,
"Adversarial: The Unrepresented Party",,,,,,,,,https://heinonline.org/HOL/Page?handle=hein.alrc/adunpar0001&collection=alrc,,adunpar,,fulltext,,"Sydney: The Commission,",monograph,1996,,,,,,,P,
"Advertising and Specialisation",,,,,,,,,https://heinonline.org/HOL/Page?handle=hein.alrc/adspec0001&collection=alrc,,adspec,,fulltext,,"[Sydney]: New South Wales Law Reform Commission,",monograph,1981,,,,,,,P,
"Aftermath: Caring for Accident Victims in New South Wales",,,,,,,,,https://heinonline.org/HOL/Page?handle=hein.alrc/aftcar0001&collection=alrc,Dewdney,aftcar,,fulltext,,"[Sydney, N.S.W.]: New South Wales Law Reform Commission,",monograph,1984,,,,,,,P,
"Aged Care: Nursing Homes, Hostels Community Aged Care Packages & the Domiciliary Nursing Care Benefit",,,,,,,,,https://heinonline.org/HOL/Page?handle=hein.alrc/ageca0001&collection=alrc,,ageca,,fulltext,,"Sydney: Australian Law Reform Commission,",monograph,1994,,,,,,,P,
"Alcohol, Drugs and Driving",,,,,,,,,https://heinonline.org/HOL/Page?handle=hein.alrc/aldrdriv0001&collection=alrc,,aldrdriv,,fulltext,,"Canberra: Australian Govt. Pub. Service,",monograph,1976,,,,,,,P,
"Alcohol, Drugs and Driving",,,,,,,,,https://heinonline.org/HOL/Page?handle=hein.alrc/aldrugdr0001&collection=alrc,,aldrugdr,,fulltext,,"[Sydney]: The Commission,",monograph,1975,,,,,,,P,
"Alternative Dispute Resolution: Discussion Paper: Training and Accreditation of Mediators",0730565688,,,,,,,,https://heinonline.org/HOL/Page?handle=hein.alrc/altdis0001&collection=alrc,,altdis,,fulltext,,"Sydney: The Commission,",monograph,1989,,,,,,,P,
"Alternative Dispute Resolution: Training and Accreditation of Mediators",0730587622,,,,,,,,https://heinonline.org/HOL/Page?handle=hein.alrc/altneg0001&collection=alrc,Hope,altneg,,fulltext,,"Sydney: The Commission,",monograph,1991,,,,,,,P,
"Alternative or Assisted Dispute Resolution",,,,,,,,,https://heinonline.org/HOL/Page?handle=hein.alrc/altassi0001&collection=alrc,,altassi,,fulltext,,"Sydney: The Commission,",monograph,1996,,,,,,,P,
"Alternatives to Imprisonment: The Fine as a Sentencing Measure",,,,,,,,,https://heinonline.org/HOL/Page?handle=hein.alrc/altimp0001&collection=alrc,Scutt,altimp,,fulltext,,"Sydney: Australian Law Reform Commission,",monograph,1979,,,,,,,P,
"Analysis of Penalties Provided in Commonwealth and Australian Capital Territory Legislation",,,,,,,,,https://heinonline.org/HOL/Page?handle=hein.alrc/anapen0001&collection=alrc,Gilchrist,anapen,,fulltext,,"Sydney: Australian Law Reform Commission,",monograph,1979,,,,,,,P,
"Anencephalics, Infants and Brain Death Treatment Options and the Issue of Organ Donation: Proceedings of Consensus Development Conference February 28-March 1, 1991",,,,,,,,,https://heinonline.org/HOL/Page?handle=hein.alrc/aninfbr0001&collection=alrc,,aninfbr,,fulltext,,"[Melbourne]: [Law Reform Commission of Victoria],",monograph,1991,,,,Sanders,,,P,
"Annual Report (Australian Law Reform Commission)",0312-6994,,1975,,,2021,,,https://heinonline.org/HOL/Index?index=alrc/alrcannrpt&collection=alrc,,alrcannrpt,,fulltext,,"Australian Law Reform Commission",serial,,,,,,,,P,1
"Annual Report (Law Reform Commission of Victoria)",0818-7320,,1985,,,1992,,,https://heinonline.org/HOL/Index?index=alrc/annrepcombjoe&collection=alrc,,annrepcombjoe,,fulltext,,,serial,,,,,,,,P,
"Artificial Conception: In Vitro Fertilization",0730544419,,,,,,,,https://heinonline.org/HOL/Index?index=alrc/artconc&collection=alrc,,artconc,,fulltext,,"Sydney: The Commission,",monograph,1987,,,,,,,P,
"Artificial Conception; Surrogate Motherhood: Australian Public Opinion",0730537986,,,,,,,,https://heinonline.org/HOL/Page?handle=hein.alrc/artconcp0001&collection=alrc,,artconcp,,fulltext,,"[Sydney]: New South Wales Law Reform Commission,",monograph,1987,,,,,,,P,
"Aspects of Proof",,,,,,,,,https://heinonline.org/HOL/Page?handle=hein.alrc/asprof0001&collection=alrc,Ball,asprof,,fulltext,,"Sydney: Australian Law Reform Commission,",monograph,1983,,,,,,,P,
"Attachment of Moneys Deposited with Building Societies and Credit Unions",0730514714,,,,,,,,https://heinonline.org/HOL/Page?handle=hein.alrc/attbuild0001&collection=alrc,,attbuild,,fulltext,,"[Sydney]: The Commission,",monograph,1985,,,,,,,P,
"Australian Admiralty Act: The Ambit of Admiralty Jurisdiction",,,,,,,,,https://heinonline.org/HOL/Page?handle=hein.alrc/ausadact0001&collection=alrc,Cremean,ausadact,,fulltext,,"Sydney, N.S.W.: Australian Law Reform Commission,",monograph,1984,,,,,,,P,
"Australian Contract Code",,,,,,,,,https://heinonline.org/HOL/Page?handle=hein.alrc/ausccod0001&collection=alrc,Ellinghaus,ausccod,,fulltext,,"Melbourne: Law Reform Commission of Victoria,",monograph,1992,,,,,,,P,
"Australian Law Reform Agencies Conference",,,,,,,,,https://heinonline.org/HOL/Index?index=alrc/auslarefcon&collection=alrc,,auslarefcon,,fulltext,,"Sydney: Law Reform Commission,",monograph,1973,,,,,,,P,
"Australia's Federal Record: A Review of Archives Act 1983",0642305366,,,,,,,,https://heinonline.org/HOL/Page?handle=hein.alrc/ausfedre0001&collection=alrc,,ausfedre,,fulltext,,"Sydney, NSW: The Commission,",monograph,1998,,,,,,,P,
"Bail Act 1977",,,,,,,,,https://heinonline.org/HOL/Page?handle=hein.alrc/blact0001&collection=alrc,,blact,,fulltext,,"[Melbourne, Vic.]: Law Reform Commission Victoria,",monograph,1989,,,,,,,P,
"Banking and Privacy",,,,,,,,,https://heinonline.org/HOL/Page?handle=hein.alrc/bankpriv0001&collection=alrc,,bankpriv,,fulltext,,"Sydney: Australian Law Reform Commission,",monograph,1981,,,,,,,P,
"Barratry, Maintenance and Champerty",0731020677,,,,,,,,https://heinonline.org/HOL/Page?handle=hein.alrc/barmain0001&collection=alrc,,barmain,,fulltext,,"Sydney: New South Wales Law Reform Commission,",monograph,1994,,,,,,,P,
"Barristers' Practising Certificates",0731029240,,,,,,,,https://heinonline.org/HOL/Page?handle=hein.alrc/barprac0001&collection=alrc,,barprac,,fulltext,,"Sydney: The Commission,",monograph,1994,,,,,,,P,
"Basic Principles of Foreign State Immunity: An Assessment of the Need for Australian Legislation",,,,,,,,,https://heinonline.org/HOL/Page?handle=hein.alrc/basprifor0001&collection=alrc,Crawford,basprifor,,fulltext,,"Sydney: Australian Law Reform Commission,",monograph,1983,,,,,,,P,
"Beyond the Door-Keeper: Standing to Sue for Public Remedies",0642245541,,,,,,,,https://heinonline.org/HOL/Page?handle=hein.alrc/bydoorke0001&collection=alrc,,bydoorke,,fulltext,,"Canberra: Australian Govt. Pub. Service,",monograph,1996,,,,,,,P,
Blasphemy,0730595137,,,,,,,,https://heinonline.org/HOL/Page?handle=hein.alrc/blasmy0001&collection=alrc,,blasmy,,fulltext,,"Sydney: New South Wales Law Reform Commission,",monograph,1992,,,,,,,P,
Blasphemy,0731041151,,,,,,,,https://heinonline.org/HOL/Page?handle=hein.alrc/blaphy0001&collection=alrc,,blaphy,,fulltext,,"Sydney: The Commission,",monograph,1994,,,,,,,P,
"Case Study Booklet",,,,,,,,,https://heinonline.org/HOL/Page?handle=hein.alrc/cstudbk0001&collection=alrc,,cstudbk,,fulltext,,"Sydney, N.S.W.: The Commission,",monograph,1984,,,,,,,P,
"Censorship Procedure",,,,,,,,,https://heinonline.org/HOL/Page?handle=hein.alrc/censop0001&collection=alrc,Ryan,censop,,fulltext,,"Sydney: Australian Law Reform Commission,",monograph,1991,,,,,,,P,
"Censorship Procedure",,,,,,,,,https://heinonline.org/HOL/Page?handle=hein.alrc/cenproc0001&collection=alrc,,cenproc,,fulltext,,"Sydney, NSW, Australia: The Commission,",monograph,1991,,,,,,,P,
"Character and Conduct",,,,,,,,,https://heinonline.org/HOL/Page?handle=hein.alrc/charcnd0001&collection=alrc,Odgers,charcnd,,fulltext,,"Sydney: Australian Law Reform Commission,",monograph,1982,,,,,,,P,
"Child Care: Review of Legislation Administered by Department of Health, Housing, Local Government and Community Services",,,,,,,,,https://heinonline.org/HOL/Page?handle=hein.alrc/chica0001&collection=alrc,,chica,,fulltext,,"Sydney: Australian Law Reform Commission,",monograph,1993,,,,,,,P,
"Child Welfare",0642060789,,,,,,,,https://heinonline.org/HOL/Page?handle=hein.alrc/chwlfe0001&collection=alrc,,chwlfe,,fulltext,,"Canberra: Australian Govt. Pub. Service,",monograph,1981,,,,,,,P,
"Child Welfare: Child Abuse and Day Care",,,,,,,,,https://heinonline.org/HOL/Page?handle=hein.alrc/cwabdc0001&collection=alrc,,cwabdc,,fulltext,,"Sydney: Australian Law Reform Commission,",monograph,1980,,,,,,,P,
"Child Welfare: Children in Trouble",0642908745,,,,,,,,https://heinonline.org/HOL/Page?handle=hein.alrc/chwtrob0001&collection=alrc,,chwtrob,,fulltext,,"Sydney: Australian Law Reform Commission,",monograph,1979,,,,,,,P,
"Children's Evidence by Video Link",,,,,,,,,https://heinonline.org/HOL/Page?handle=hein.alrc/chevlk0001&collection=alrc,,chevlk,,fulltext,,"Sydney: Australian Law Reform Commission,",monograph,1989,,,,,,,P,
"Children's Evidence: Closed Circuit TV",,,,,,,,,https://heinonline.org/HOL/Page?handle=hein.alrc/chievcir0001&collection=alrc,,chievcir,,fulltext,,"Sydney, NSW: The Commission,",monograph,1992,,,,,,,P,
"Choice of Law",0064217453,,,,,,,,https://heinonline.org/HOL/Page?handle=hein.alrc/cholaw0001&collection=alrc,,cholaw,,fulltext,,"Sydney, NSW, Australia: The Commission,",monograph,1992,,,,,,,P,
"Choice of Law Rules",0646010611,,,,,,,,https://heinonline.org/HOL/Page?handle=hein.alrc/chlaru0001&collection=alrc,Hennessy,chlaru,,fulltext,,"Sydney: Australian Law Reform Commission,",monograph,1990,,,,,,,P,
"Circulation of Legal Advice to Government",0731310136,,,,,,,,https://heinonline.org/HOL/Page?handle=hein.alrc/cirlgad0001&collection=alrc,,cirlgad,,fulltext,,"Sydney: The Commission,",monograph,1997,,,,,,,P,
"Circulation of Legal Advice to Government",0731310217,,,,,,,,https://heinonline.org/HOL/Page?handle=hein.alrc/cirlgadv0001&collection=alrc,,cirlgadv,,fulltext,,"Sydney: The Commission,",monograph,1998,,,,,,,P,
"Civil Admiralty Jurisdiction",0644013540,,,,,,,,https://heinonline.org/HOL/Page?handle=hein.alrc/civadjur0001&collection=alrc,,civadjur,,fulltext,,"Canberra: Australian Govt. Pub. Service,",monograph,1986,,,,,,,P,
"Classification - Content Regulation and Convergent Media: Final Report",9780987177735,,,,,,,,https://heinonline.org/HOL/Index?index=alrc/clascont&collection=alrc,,clascont,,fulltext,,"Sydney: Australian Law Reform Commission,",monograph,2012,,,,,,,P,
"Client Legal Privilege and Federal Investigatory Bodies: Discussion Paper",9780980415308,,,,,,,,https://heinonline.org/HOL/Page?handle=hein.alrc/clegpriv0001&collection=alrc,,clegpriv,,fulltext,,"Sydney, NSW, Australia: Australian Law Reform Commission,",monograph,2007,,,,,,,P,
"Client Legal Privilege and Federal Investigatory Bodies: Issues Paper",9780975821381,,,,,,,,https://heinonline.org/HOL/Page?handle=hein.alrc/cltlgprv0001&collection=alrc,,cltlgprv,,fulltext,,"Sydney: Australian Law Reform Commission,",monograph,2007,,,,,,,P,
"Codes of Practice",0730605671,,,,,,,,https://heinonline.org/HOL/Page?handle=hein.alrc/cdpract0001&collection=alrc,,cdpract,,fulltext,,"[Victoria]: Law Reform Commission of Victoria,",monograph,1990,,,,,,,P,
"Codes of Practice",0730605736,,,,,,,,https://heinonline.org/HOL/Page?handle=hein.alrc/codprct0001&collection=alrc,,codprct,,fulltext,,"[Melbourne]: Law Reform Commission of Victoria,",monograph,1991,,,,,,,P,
"Collective Investment Schemes",,,,,,,,,https://heinonline.org/HOL/Page?handle=hein.alrc/colinvs0001&collection=alrc,,colinvs,,fulltext,,"Sydney: Australian Law Reform Commission,",monograph,1992,,,,,,,P,
"Collective Investment Schemes",,,,,,,,,https://heinonline.org/HOL/Page?handle=hein.alrc/colinvsc0001&collection=alrc,Agnew,colinvsc,,fulltext,,"Sydney, NSW: Australian Law Reform Commission,",monograph,1991,,,,,,,P,
"Collective Investment Schemes: Superannuation",,,,,,,,,https://heinonline.org/HOL/Page?handle=hein.alrc/civsc0001&collection=alrc,,civsc,,fulltext,,"Sydney: Australian Law Reform Commission,",monograph,1992,,,,,,,P,
"Collective Investments: Other People's Money",0642193509,,,,,,,,https://heinonline.org/HOL/Index?index=alrc/colinvot&collection=alrc,,colinvot,,fulltext,,"Sydney, N.S.W., Australia: The Committee,",monograph,1993,,,,,,,P,
"Collective Investments: Superannuation: Report",064217508X,,,,,,,,https://heinonline.org/HOL/Page?handle=hein.alrc/colinv0001&collection=alrc,,colinv,,fulltext,,"Sydney, NSW, Australia: The Commission,",monograph,1992,,,,,,,P,
"Coming of Age: New Aged Care Legislation for the Commonwealth: Review of Legislation Administered by Department of Human Services and Health",0642225281,,,,,,,,https://heinonline.org/HOL/Page?handle=hein.alrc/comage0001&collection=alrc,,comage,,fulltext,,"Sydney, NSW, Australia: Law Reform Commission,",monograph,1995,,,,,,,P,
"Commencing Process",,,,,,,,,https://heinonline.org/HOL/Page?handle=hein.alrc/commpr0001&collection=alrc,Pryles,commpr,,fulltext,,"Sydney, NSW: Australian Law Reform Commission,",monograph,1984,,,,,,,P,
"Common Law of Evidence: Areas of Disagreement and Uncertainty",,,,,,,,,https://heinonline.org/HOL/Page?handle=hein.alrc/comlwevid0001&collection=alrc,Odgers,comlwevid,,fulltext,,"Sydney: Australian Law Reform Commission,",monograph,1981,,,,,,,P,
"Commonwealth Disability Services Legislation: the Commonwealth's Disability Services Program and the Commonwealth Rehabilitation Service",0642233837,,,,,,,,https://heinonline.org/HOL/Page?handle=hein.alrc/comdisse0001&collection=alrc,,comdisse,,fulltext,,"Sydney, NSW: Australian Law Reform Commission,",monograph,1995,,,,,,,P,
"Commonwealth Disability Services: Questions for People Who Use Disability Services and People Who Would like to Use Them",064222790X,,,,,,,,https://heinonline.org/HOL/Page?handle=hein.alrc/cmdiserv0001&collection=alrc,Hayward,cmdiserv,,fulltext,,"Sydney: Australian Law Reform Commission,",monograph,1995,,,,,,,P,
"Commonwealth Prisoners Act",0644069007,,,,,,,,https://heinonline.org/HOL/Page?handle=hein.alrc/comprisac0001&collection=alrc,,comprisac,,fulltext,,"Canberra: Australian Govt. Pub. Service,",monograph,1988,,,,,,,P,
"Community Law Reform for the Australian Capital Territory: Enduring Powers of Attorney",,,,,,,,,https://heinonline.org/HOL/Page?handle=hein.alrc/clrauct0001&collection=alrc,,clrauct,,fulltext,,"Sydney: Australian Law Reform Commission,",monograph,1987,,,,,,,P,
"Community Law Reform for the Australian Capital Territory: First Report",0644013257,,,,,,,,https://heinonline.org/HOL/Page?handle=hein.alrc/comlwfrm0001&collection=alrc,,comlwfrm,,fulltext,,"Canberra: Australian Govt. Pub. Serv,",monograph,1985,,,,,,,P,
"Community Law Reform for the Australian Capital Territory: Second Report",0644013516,,,,,,,,https://heinonline.org/HOL/Page?handle=hein.alrc/comlwref0001&collection=alrc,,comlwref,,fulltext,,"Canberra: Australian Govt. Pub. Service,",monograph,1986,,,,,,,P,
"Community Law Reform for the Australian Capital Territory: Third Report: Enduring Powers of Attorney",0644013257,,,,,,,,https://heinonline.org/HOL/Page?handle=hein.alrc/comlaref0001&collection=alrc,,comlaref,,fulltext,,"Canberra: Australian Government Pub. Service,",monograph,1988,,,,,,,P,
"Community Law Reform Program, Eighth Report: Wills - Execution and Revocation",0730514943,,,,,,,,https://heinonline.org/HOL/Page?handle=hein.alrc/eighrpt0001&collection=alrc,,eighrpt,,fulltext,,"[Sydney]: The Commission,",monograph,1986,,,,,,,P,
"Community Law Reform Program, First Report: Insurance Contracts - Non-Disclosure and Misrepresentation",0730500624,,,,,,,,https://heinonline.org/HOL/Page?handle=hein.alrc/firrptcont0001&collection=alrc,,firrptcont,,fulltext,,"[Sydney]: Government Printer,",monograph,1983,,,,,,,P,
"Community Law Reform Program: Neighbour and Neighbour Relations",0730586049,,,,,,,,https://heinonline.org/HOL/Page?handle=hein.alrc/comlawrf0001&collection=alrc,,comlawrf,,fulltext,,"Sydney: The Commission,",monograph,1991,,,,,,,P,